Next Hour - Movie Tv Show & Video Subscription Portal Cms

Next Hour - Movie Tv Show & Video Subscription Portal Cms 4.0

No permission to download
  • You MUST read the Babiato Rules before making your first post otherwise you may get permanent warning points or a permanent Ban.

  • You MUST read the Babiato Rules before making your first post otherwise you may get permanent warning points or a permanent Ban.

    Our resources on Babiato Forum are CLEAN and SAFE. So you can use them for development and testing purposes. If your are on Windows and have an antivirus that alerts you about a possible infection: Know it's a false positive because all scripts are double checked by our experts. We advise you to add Babiato to trusted sites/sources or disable your antivirus momentarily while downloading a resource. "Enjoy your presence on Babiato"

kdx20

New member
Apr 12, 2020
9
0
1
Hello I am getting this Error mostly when moving to Live tv and Movies page... Pls suggest fiximage_2021-07-25_164700.png
 

darkmindz13

Member
Oct 2, 2019
52
46
18
Greetings, any help to solve the problem please, run the application script next hour from android studio and I get this error, how could I fix it, please someone have the answer?


FAILURE: Build failed with an exception.

* What went wrong:
Could not determine the dependencies of task ':braintree_payment:compileDebugAidl'.
> Could not resolve all task dependencies for configuration ':braintree_payment:debugCompileClasspath'.
> Could not resolve org.jfrog.cardinalcommerce.gradle:cardinalmobilesdk:2.2.1-2.
Required by:
project :braintree_payment > com.braintreepayments.api:three-d-secure:3.7.2
> Could not resolve org.jfrog.cardinalcommerce.gradle:cardinalmobilesdk:2.2.1-2.
> Could not get resource 'https://cardinalcommerce.bintray.co...bilesdk/2.2.1-2/cardinalmobilesdk-2.2.1-2.pom'.
> Could not GET 'https://cardinalcommerce.bintray.co...bilesdk/2.2.1-2/cardinalmobilesdk-2.2.1-2.pom'. Received status code 403 from server: Forbidden

* Try:
Run with --stacktrace option to get the stack trace. Run with --info or --debug option to get more log output. Run with --scan to get full insights.

* Get more help at https://help.gradle.org

BUILD FAILED in 1m 52s
Exception: Gradle task assembleDebug failed with exit code 1
replace these lines in flutter path > pub-cache/hosted/pub.dartlang.org>braintree_payment-1.2.4>android>build.gradle

Code:
You don't have permission to view the code content. Log in or register now.
 

Slayer143

Member
Jul 24, 2020
36
6
8
its no where
Nothing about it
no details was asked regarding inapp purchase
nothing about subscription nor even product ID
 

mintumamama

New member
Jul 27, 2021
5
0
1
I download Nexthour Script here and I face This Problem. When I install Asked Me for Purchase Details I put 1234567890 and Show Me Invalid Code Plz Help Me
Capture.JPG

 

Similar threads

Forum statistics

Threads
54,626
Messages
619,843
Members
149,281
Latest member
angga234
AdBlock Detected

We get it, advertisements are annoying!

Sure, ad-blocking software does a great job at blocking ads, but it also blocks useful features of our website. For the best site experience please disable your AdBlocker.

I've Disabled AdBlock    No Thanks